{"text_format":"1","workbook":"xlsx","n_sheets":5,"sheets":["Readme","Input (Quick)","Input (Extended)","Output (Numeric)","Output (Graphical)"],"not_rendered":{"charts":21,"images":2,"macros":1,"external_links":0,"defined_names":0,"comments":0,"pivot_tables":0},"unopened":[],"bounds":{"document_bytes":16777216,"sheet_cells":100000,"rows_first":2000,"rows_last":500,"rows_between":2000,"halvings":0,"cell_chars":16384,"cell_head_chars":4096},"cells_cut":0,"cells_raw":0,"read":"whole","date_system":"1900"}

{"sheet":"Readme","index":0,"n_rows":42,"n_cols":27,"rows_kept":42,"cut":false,"hidden":false,"merged":[[28,13,28,26],[30,0,31,0],[32,0,40,0],[28,2,28,12]]}
[]
[]
[]
[]
[]
[]
[]
[]
[]
[]
[]
[]
[]
[]
[]
[]
[]
[]
[]
[]
{"$rows_left_out":23}
{"sheet":"Input (Quick)","index":1,"n_rows":69,"n_cols":19,"rows_kept":69,"cut":false,"hidden":false,"merged":[[13,2,13,8],[48,0,64,0],[42,0,44,0]]}
[]
[]
[]
[]
[]
[]
[]
[]
[]
[]
[]
["MANDATORY USER INPUTS"]
[]
[null,null,"Mandatory baseline inputs"]
[]
[null,null,null,"Total number of CC beds",null,null,"Number of COVID-19 patients in CC beds"]
[]
[null,null,null,"Total number of G&A beds",null,null,"Number of COVID-19 patients in G&A beds"]
[]
[null,null,null,"Number of CC beds occupied by non-COVID-19 patients",null,null,"COVID-19-related sickness rate for nurses (%)"]
{"$rows_left_out":50}
{"sheet":"Input (Extended)","index":2,"n_rows":49,"n_cols":28,"rows_kept":49,"cut":false,"hidden":false,"merged":[[23,13,23,27],[13,14,13,19],[13,2,13,13],[17,2,17,6],[17,7,17,8],[46,2,46,9],[23,2,23,12],[26,0,28,0],[30,0,39,0],[41,0,42,0]]}
[]
[]
[]
[]
[]
[]
[]
[]
[]
[]
[]
["USER INPUTS"]
[]
[null,null,"Baseline Inputs on Existing Hospital Capacity",null,null,null,null,null,null,null,null,null,null,null,"Maximum Staff Ratio Allowances Inputs"]
[null,null,"Total number of CC beds","Total number of G&A beds","Number of CC beds occupied by non-COVID-19 patients","Number of G&A beds occupied by non-COVID-19 patients","Percentage of non-COVID-19 CC patients requiring ventilator","Total number of ventilators","Total CC nurses (FTE)","Total G&A nurses (FTE)","Total CC senior doctors (FTE)","Total CC junior doctors (FTE)","Total G&A senior doctors (FTE)","Total G&A junior doctors (FTE)","Beds per CC nurse","Beds per G&A nurse","Beds per CC senior doctor","Beds per CC junior doctor","Beds per G&A senior doctor","Beds per G&A junior doctor"]
[null,null,{"$f":"IF(ISBLANK('Input (Quick)'!E16),4123,'Input (Quick)'!E16)","v":4123},{"$f":"IF(ISBLANK('Input (Quick)'!E18),99935,'Input (Quick)'!E18)","v":99935},{"$f":"IF(ISBLANK('Input (Quick)'!E20),3423,'Input (Quick)'!E20)","v":3423},{"$f":"IF(ISBLANK('Input (Quick)'!E22),91971,'Input (Quick)'!E22)","v":91971},0.43,{"$f":"IF(ISBLANK('Input (Quick)'!E24),8175,'Input (Quick)'!E24)","v":8175},{"$f":"IF(ISBLANK('Input (Quick)'!E26),3939,'Input (Quick)'!E26)","v":3939},{"$f":"IF(ISBLANK('Input (Quick)'!E28),32354,'Input (Quick)'!E28)","v":32354},{"$f":"IF(ISBLANK('Input (Quick)'!E30),965,'Input (Quick)'!E30)","v":965},{"$f":"IF(ISBLANK('Input (Quick)'!E32),677,'Input (Quick)'!E32)","v":677},{"$f":"IF(ISBLANK('Input (Quick)'!E34),12680,'Input (Quick)'!E34)","v":12680},{"$f":"IF(ISBLANK('Input (Quick)'!E36),10293,'Input (Quick)'!E36)","v":10293},1,5,15,8,15,15]
[]
[null,null,"COVID-19-related Inputs",null,null,null,null,"Additional Inputs"]
[null,null,"Number of COVID-19 patients in CC beds","Number of COVID-19 patients in G&A beds","Percentage of COVID-19 CC patients requiring ventilator","COVID-19-related sickness rate for nurses","COVID-19-related sickness rate for doctors","Headcount to FTE multiplier","Reference population size for output calculation"]
[null,null,{"$f":"IF(ISBLANK('Input (Quick)'!H16),1480,'Input (Quick)'!H16)","v":1480},{"$f":"IF(ISBLANK('Input (Quick)'!H18),7770,'Input (Quick)'!H18)","v":7770},0.63,{"$f":"IF(ISBLANK('Input (Quick)'!H20),0.081,'Input (Quick)'!H20)","v":8.1000000000000003E-2},{"$f":"IF(ISBLANK('Input (Quick)'!H22),0.14,'Input (Quick)'!H22)","v":0.14000000000000001},0.88,{"$f":"IF(ISBLANK('Input (Quick)'!H24),55977200,'Input (Quick)'!H24)","v":55977200}]
{"$rows_left_out":30}
{"sheet":"Output (Numeric)","index":3,"n_rows":31,"n_cols":53,"rows_kept":31,"cut":false,"hidden":false,"merged":[[9,27,9,52],[9,20,9,25],[13,0,16,0],[18,0,27,0],[29,0,30,0],[11,0,12,0],[9,2,9,10],[9,11,9,19]]}
[]
[]
[]
[]
[]
[]
[]
[]
[]
[null,null,"SPARE CAPACITY PER 10,000 POPULATION",null,null,null,null,null,null,null,null,"PERCENT CHANGE IN SPARE CAPACITY COMPARED TO BASELINE",null,null,null,null,null,null,null,null,"STAFF PLANNER: STAFF REQUIRED FOR TOTAL BED NUMBERS ",null,null,null,null,null,null,"CALCULATIONS: DIFFERENCE FROM BASELINE"]
[null,null,"CC beds","G&A beds","Ventilators","CC nurses"," G&A nurses","CC senior doctors","CC junior doctors","G&A senior doctors","G&A junior doctors","CC beds","G&A beds","Ventilators","CC nurses"," G&A nurses","CC senior doctors","CC junior doctors","G&A senior doctors","G&A junior doctors","CC nurses needed for total bed numbers","G&A nurses needed for total bed numbers","CC senior doctors needed for total bed numbers","CC junior doctors needed for total bed numbers","G&A senior doctors needed for total bed numbers","G&A junior doctors needed for total bed numbers",null,"Total CC beds","Total G&A beds","CC beds occupied non-COVID-19 ","G&A beds occupied non-COVID-19 ","CC beds needed total (for non-COVID-19 + COVID-19  patients)","G&A beds needed total (for non-COVID-19 + COVID-19  patients)","Total ventilators ","Total CC nurses (FTE)","CC nurse to beds needed ratio","Total G&A nurses (FTE)","G&A nurse to beds needed  ratio","Total CC senior doctors (FTE)","CC senior doctor to beds needed ratio","Total CC junior doctors  (FTE)","CC junior doctor to beds needed ratio","Total G&A senior doctors (FTE)","G&A senior doctor to beds needed ratio","Total G&A junior doctors (FTE)","G&A junior doctor to beds needed  ratio","Ventilators needed for patients","CC nurses needed for patients","G&A nurses needed for patients","CC senior doctors needed for patients","CC junior doctors needed for patients","G&A senior doctors needed for patients","G&A junior doctors needed for patients"]
["Baseline"]
[null,null,{"$f":"ROUND((AB13-AF13)*10000/'Input (Extended)'!I20,2)","v":-0.14000000000000001},{"$f":"ROUND((AC13-AG13)*10000/'Input (Extended)'!I20,2)","v":0.03},{"$f":"ROUND((AH13-AU13)*10000/'Input (Extended)'!I20,2)","v":1.03},{"$f":"ROUND((AI13-AV13)*10000/'Input (Extended)'!I20,2)","v":-0.23},{"$f":"ROUND((AK13-AW13)*10000/'Input (Extended)'!I20,2)","v":1.75},{"$f":"ROUND((AM13-AX13)*10000/'Input (Extended)'!I20,2)","v":0.09},{"$f":"ROUND((AO13-AY13)*10000/'Input (Extended)'!I20,2)","v":-0.01},{"$f":"ROUND((AQ13-AZ13)*10000/'Input (Extended)'!I20,2)","v":0.76},{"$f":"ROUND((AS13-BA13)*10000/'Input (Extended)'!I20,2)","v":0.39},null,null,null,null,null,null,null,null,null,{"$f":"AB13/'Input (Extended)'!$O$16","v":4123},{"$f":"AC13/'Input (Extended)'!$P$16","v":19987},{"$f":"AB13/'Input (Extended)'!$Q$16","v":274.86666666666667},{"$f":"AB13/'Input (Extended)'!$R$16","v":515.375},{"$f":"AC13/'Input (Extended)'!$S$16","v":6662.333333333333},{"$f":"AC13/'Input (Extended)'!$T$16","v":6662.333333333333},null,{"$f":"'Input (Extended)'!C16","v":4123},{"$f":"'Input (Extended)'!D16","v":99935},{"$f":"'Input (Extended)'!E16","v":3423},{"$f":"'Input (Extended)'!F16","v":91971},{"$f":"AD13+'Input (Extended)'!$C$20","v":4903},{"$f":"AE13+'Input (Extended)'!$D$20","v":99741},{"$f":"'Input (Extended)'!H16","v":8175},{"$f":"(1-'Input (Extended)'!F20)*'Input (Extended)'!I16","v":3619.9410000000003},{"$f":"AF13/AI13","v":1.3544419646618548},{"$f":"(1-'Input (Extended)'!F20)*'Input (Extended)'!J16","v":29733.326000000001},{"$f":"AG13/AK13","v":3.3545187645674082},{"$f":"(1-'Input (Extended)'!G20)*'Input (Extended)'!K16","v":829.9},{"$f":"AF13/AM13","v":5.9079407157488859},{"$f":"(1-'Input (Extended)'!G20)*'Input (Extended)'!L16","v":582.22},{"$f":"AF13/AO13","v":8.4212153481501826},{"$f":"(1-'Input (Extended)'!G20)*'Input (Extended)'!M16","v":10904.8},{"$f":"AG13/AQ13","v":9.1465226322353459},{"$f":"(1-'Input (Extended)'!G20)*'Input (Extended)'!N16","v":8851.98},{"$f":"AG13/AS13","v":11.267648593873913},{"$f":"(AD13*'Input (Extended)'!G16)+('Input (Extended)'!C20*'Input (Extended)'!E20)","v":2404.29},{"$f":"AF13/'Input (Extended)'!$O$16","v":4903},{"$f":"AG13/'Input (Extended)'!$P$16","v":19948.2},{"$f":"AF13/'Input (Extended)'!$Q$16","v":326.86666666666667},{"$f":"AF13/'Input (Extended)'!$R$16","v":612.875},{"$f":"AG13/'Input (Extended)'!$S$16","v":6649.4},{"$f":"AG13/'Input (Extended)'!$T$16","v":6649.4}]
["Managing admissions"]
[null,"Cancellation of elective operations",{"$f":"ROUND((AB15-AF15)*10000/'Input (Extended)'!I20,2)","v":0.04},{"$f":"ROUND((AC15-AG15)*10000/'Input (Extended)'!I20,2)","v":6.77},{"$f":"ROUND((AH15-AU15)*10000/'Input (Extended)'!I20,2)","v":1.1100000000000001},{"$f":"ROUND((AI15-AV15)*10000/'Input (Extended)'!I20,2)","v":-0.05},{"$f":"ROUND((AK15-AW15)*10000/'Input (Extended)'!I20,2)","v":3.1},{"$f":"ROUND((AM15-AX15)*10000/'Input (Extended)'!I20,2)","v":0.1},{"$f":"ROUND((AO15-AY15)*10000/'Input (Extended)'!I20,2)","v":0.02},{"$f":"ROUND((AQ15-AZ15)*10000/'Input (Extended)'!I20,2)","v":1.21},{"$f":"ROUND((AS15-BA15)*10000/'Input (Extended)'!I20,2)","v":0.84},{"$f":"IF(C13=0,0,(C15-C13)/ABS(C13))","v":1.2857142857142858},{"$f":"IF(D13=0,0,(D15-D13)/ABS(D13))","v":224.66666666666666},7.7669902912621422E-2,0.78260869565217384,0.77142857142857146,0.11111111111111122,3,0.59210526315789469,1.1538461538461537,{"$f":"AB15/'Input (Extended)'!$O$16","v":4123},{"$f":"AC15/'Input (Extended)'!$P$16","v":19987},{"$f":"AB15/'Input (Extended)'!$Q$16","v":274.86666666666667},{"$f":"AB15/'Input (Extended)'!$R$16","v":515.375},{"$f":"AC15/'Input (Extended)'!$S$16","v":6662.333333333333},{"$f":"AC15/'Input (Extended)'!$T$16","v":6662.333333333333},null,{"$f":"(1+'Input (Extended)'!C27)*$AB$13","v":4123},{"$f":"(1+'Input (Extended)'!D27)*$AC$13","v":99935},{"$f":"(1-'Input (Extended)'!E27)*$AD$13","v":2396.1},{"$f":"(1-'Input (Extended)'!F27)*$AE$13","v":54262.890000000007},{"$f":"AD15+'Input (Extended)'!$C$20","v":3876.1},{"$f":"AE15+'Input (Extended)'!$D$20","v":62032.890000000007},{"$f":"(1+'Input (Extended)'!G27)*$AH$13","v":8175},{"$f":"(1+'Input (Extended)'!H27)*(1-'Input (Extended)'!$F$20)*'Input (Extended)'!$I$16","v":3619.9410000000003},{"$f":"AF15/AI15","v":1.0707633080207659},{"$f":"(1+'Input (Extended)'!I27)*(1-'Input (Extended)'!$F$20)*'Input (Extended)'!$J$16","v":29733.326000000001},{"$f":"AG15/AK15","v":2.0863084742016418},{"$f":"(1+'Input (Extended)'!J27)*(1-'Input (Extended)'!$G$20)*'Input (Extended)'!$K$16","v":829.9},{"$f":"AF15/AM15","v":4.6705627183998075},{"$f":"(1+'Input (Extended)'!K27)*(1-'Input (Extended)'!$G$20)*'Input (Extended)'!$L$16","v":582.22},{"$f":"AF15/AO15","v":6.6574490742331074},{"$f":"(1+'Input (Extended)'!L27)*(1-'Input (Extended)'!$G$20)*'Input (Extended)'!$M$16","v":10904.8},{"$f":"AG15/AQ15","v":5.688585760399091},{"$f":"(1+'Input (Extended)'!M27)*(1-'Input (Extended)'!$G$20)*'Input (Extended)'!$N$16","v":8851.98},{"$f":"AG15/AS15","v":7.0077982553055937},{"$f":"(AD15*'Input (Extended)'!$G$16)+('Input (Extended)'!$C$20*'Input (Extended)'!$E$20)","v":1962.723},{"$f":"AF15/'Input (Extended)'!$O$16","v":3876.1},{"$f":"AG15/'Input (Extended)'!$P$16","v":12406.578000000001},{"$f":"AF15/'Input (Extended)'!$Q$16","v":258.40666666666664},{"$f":"AF15/'Input (Extended)'!$R$16","v":484.51249999999999},{"$f":"AG15/'Input (Extended)'!$S$16","v":4135.5260000000007},{"$f":"AG15/'Input (Extended)'!$T$16","v":4135.5260000000007}]
[null,"National guidelines for the prioritisation of CC scenarios",{"$f":"ROUND((AB16-AF16)*10000/'Input (Extended)'!I20,2)","v":0.23},{"$f":"ROUND((AC16-AG16)*10000/'Input (Extended)'!I20,2)","v":0.03},{"$f":"ROUND((AH16-AU16)*10000/'Input (Extended)'!I20,2)","v":1.19},{"$f":"ROUND((AI16-AV16)*10000/'Input (Extended)'!I20,2)","v":0.14000000000000001},{"$f":"ROUND((AK16-AW16)*10000/'Input (Extended)'!I20,2)","v":1.75},{"$f":"ROUND((AM16-AX16)*10000/'Input (Extended)'!I20,2)","v":0.11},{"$f":"ROUND((AO16-AY16)*10000/'Input (Extended)'!I20,2)","v":0.04},{"$f":"ROUND((AQ16-AZ16)*10000/'Input (Extended)'!I20,2)","v":0.76},{"$f":"ROUND((AS16-BA16)*10000/'Input (Extended)'!I20,2)","v":0.39},{"$f":"IF(C13 = 0,0,(C16-C13)/ABS(C13))","v":2.6428571428571428},{"$f":"IF(D13 = 0,0,(D16-D13)/ABS(D13))","v":0},0.15533980582524265,1.6086956521739129,0,0.22222222222222227,5,0,0,{"$f":"AB16/'Input (Extended)'!$O$16","v":4123},{"$f":"AC16/'Input (Extended)'!$P$16","v":19987},{"$f":"AB16/'Input (Extended)'!$Q$16","v":274.86666666666667},{"$f":"AB16/'Input (Extended)'!$R$16","v":515.375},{"$f":"AC16/'Input (Extended)'!$S$16","v":6662.333333333333},{"$f":"AC16/'Input (Extended)'!$T$16","v":6662.333333333333},null,{"$f":"(1+'Input (Extended)'!C28)*$AB$13","v":4123},{"$f":"(1+'Input (Extended)'!D28)*$AC$13","v":99935},{"$f":"(1-'Input (Extended)'!E28)*$AD$13","v":1369.2},{"$f":"(1-'Input (Extended)'!F28)*$AE$13","v":91971},{"$f":"AD16+'Input (Extended)'!$C$20","v":2849.2},{"$f":"AE16+'Input (Extended)'!$D$20","v":99741},{"$f":"(1+'Input (Extended)'!G28)*$AH$13","v":8175},{"$f":"(1+'Input (Extended)'!H28)*(1-'Input (Extended)'!$F$20)*'Input (Extended)'!$I$16","v":3619.9410000000003},{"$f":"AF16/AI16","v":0.78708465137967709},{"$f":"(1+'Input (Extended)'!I28)*(1-'Input (Extended)'!$F$20)*'Input (Extended)'!$J$16","v":29733.326000000001},{"$f":"AG16/AK16","v":3.3545187645674082},{"$f":"(1+'Input (Extended)'!J28)*(1-'Input (Extended)'!$G$20)*'Input (Extended)'!$K$16","v":829.9},{"$f":"AF16/AM16","v":3.4331847210507287},{"$f":"(1+'Input (Extended)'!K28)*(1-'Input (Extended)'!$G$20)*'Input (Extended)'!$L$16","v":582.22},{"$f":"AF16/AO16","v":4.8936828003160313},{"$f":"(1+'Input (Extended)'!L28)*(1-'Input (Extended)'!$G$20)*'Input (Extended)'!$M$16","v":10904.8},{"$f":"AG16/AQ16","v":9.1465226322353459},{"$f":"(1+'Input (Extended)'!M28)*(1-'Input (Extended)'!$G$20)*'Input (Extended)'!$N$16","v":8851.98},{"$f":"AG16/AS16","v":11.267648593873913},{"$f":"(AD16*'Input (Extended)'!$G$16)+('Input (Extended)'!$C$20*'Input (Extended)'!$E$20)","v":1521.1559999999999},{"$f":"AF16/'Input (Extended)'!$O$16","v":2849.2},{"$f":"AG16/'Input (Extended)'!$P$16","v":19948.2},{"$f":"AF16/'Input (Extended)'!$Q$16","v":189.94666666666666},{"$f":"AF16/'Input (Extended)'!$R$16","v":356.15},{"$f":"AG16/'Input (Extended)'!$S$16","v":6649.4},{"$f":"AG16/'Input (Extended)'!$T$16","v":6649.4}]
[null,"Add extra rows as necessary for additional demand-side scenarios"]
[]
["Increasing and re-organising care","Set up of field hospitals ",{"$f":"ROUND((AB19-AF19)*10000/'Input (Extended)'!I20,2)","v":-0.05},{"$f":"ROUND((AC19-AG19)*10000/'Input (Extended)'!I20,2)","v":1.46},{"$f":"ROUND((AH19-AU19)*10000/'Input (Extended)'!I20,2)","v":1.03},{"$f":"ROUND((AI19-AV19)*10000/'Input (Extended)'!I20,2)","v":-0.23},{"$f":"ROUND((AK19-AW19)*10000/'Input (Extended)'!I20,2)","v":1.75},{"$f":"ROUND((AM19-AX19)*10000/'Input (Extended)'!I20,2)","v":0.09},{"$f":"ROUND((AO19-AY19)*10000/'Input (Extended)'!I20,2)","v":-0.01},{"$f":"ROUND((AQ19-AZ19)*10000/'Input (Extended)'!I20,2)","v":0.76},{"$f":"ROUND((AS19-BA19)*10000/'Input (Extended)'!I20,2)","v":0.39},{"$f":"IF(C13 = 0, 0,(C19-C13)/ABS(C13))","v":0.6428571428571429},{"$f":"IF(D13 = 0, 0,(D19-D13)/ABS(D13))","v":47.666666666666664},0,0,0,0,0,0,0,{"$f":"AB19/'Input (Extended)'!$O$16","v":4623},{"$f":"AC19/'Input (Extended)'!$P$16","v":21587},{"$f":"AB19/'Input (Extended)'!$Q$16","v":308.2},{"$f":"AB19/'Input (Extended)'!$R$16","v":577.875},{"$f":"AC19/'Input (Extended)'!$S$16","v":7195.666666666667},{"$f":"AC19/'Input (Extended)'!$T$16","v":7195.666666666667},null,{"$f":"(1+'Input (Extended)'!C31)*$AB$13","v":4623},{"$f":"(1+'Input (Extended)'!D31)*$AC$13","v":107935},{"$f":"(1-'Input (Extended)'!E31)*$AD$13","v":3423},{"$f":"(1-'Input (Extended)'!F31)*$AE$13","v":91971},{"$f":"AD19+'Input (Extended)'!$C$20","v":4903},{"$f":"AE19+'Input (Extended)'!$D$20","v":99741},{"$f":"(1+'Input (Extended)'!G31)*$AH$13","v":8175},{"$f":"(1+'Input (Extended)'!H31)*(1-'Input (Extended)'!$F$20)*'Input (Extended)'!$I$16","v":3619.9410000000003},{"$f":"AF19/AI19","v":1.3544419646618548},{"$f":"(1+'Input (Extended)'!I31)*(1-'Input (Extended)'!$F$20)*'Input (Extended)'!$J$16","v":29733.326000000001},{"$f":"AG19/AK19","v":3.3545187645674082},{"$f":"(1+'Input (Extended)'!J31)*(1-'Input (Extended)'!$G$20)*'Input (Extended)'!$K$16","v":829.9},{"$f":"AF19/AM19","v":5.9079407157488859},{"$f":"(1+'Input (Extended)'!K31)*(1-'Input (Extended)'!$G$20)*'Input (Extended)'!$L$16","v":582.22},{"$f":"AF19/AO19","v":8.4212153481501826},{"$f":"(1+'Input (Extended)'!L31)*(1-'Input (Extended)'!$G$20)*'Input (Extended)'!$M$16","v":10904.8},{"$f":"AG19/AQ19","v":9.1465226322353459},{"$f":"(1+'Input (Extended)'!M31)*(1-'Input (Extended)'!$G$20)*'Input (Extended)'!$N$16","v":8851.98},{"$f":"AG19/AS19","v":11.267648593873913},{"$f":"(AD19*'Input (Extended)'!$G$16)+('Input (Extended)'!$C$20*'Input (Extended)'!$E$20)","v":2404.29},{"$f":"AF19/'Input (Extended)'!$O$16","v":4903},{"$f":"AG19/'Input (Extended)'!$P$16","v":19948.2},{"$f":"AF19/'Input (Extended)'!$Q$16","v":326.86666666666667},{"$f":"AF19/'Input (Extended)'!$R$16","v":612.875},{"$f":"AG19/'Input (Extended)'!$S$16","v":6649.4},{"$f":"AG19/'Input (Extended)'!$T$16","v":6649.4}]
[null,"Use of private hospital resources ",{"$f":"ROUND((AB20-AF20)*10000/'Input (Extended)'!I20,2)","v":-0.08},{"$f":"ROUND((AC20-AG20)*10000/'Input (Extended)'!I20,2)","v":1.41},{"$f":"ROUND((AH20-AU20)*10000/'Input (Extended)'!I20,2)","v":1.25},{"$f":"ROUND((AI20-AV20)*10000/'Input (Extended)'!I20,2)","v":-7.0000000000000007E-2},{"$f":"ROUND((AK20-AW20)*10000/'Input (Extended)'!I20,2)","v":3.04},{"$f":"ROUND((AM20-AX20)*10000/'Input (Extended)'!I20,2)","v":0.09},{"$f":"ROUND((AO20-AY20)*10000/'Input (Extended)'!I20,2)","v":0},{"$f":"ROUND((AQ20-AZ20)*10000/'Input (Extended)'!I20,2)","v":0.81},{"$f":"ROUND((AS20-BA20)*10000/'Input (Extended)'!I20,2)","v":0.43},{"$f":"IF(C13=0,0,(C20-C13)/ABS(C13))","v":0.4285714285714286},{"$f":"IF(D13=0,0,(D20-D13)/ABS(D13))","v":46},0.2135922330097087,0.69565217391304346,0.73714285714285721,0,1,6.5789473684210578E-2,0.10256410256410251,{"$f":"AB20/'Input (Extended)'!$O$16","v":4453.9770704799239},{"$f":"AC20/'Input (Extended)'!$P$16","v":21523.604585904017},{"$f":"AB20/'Input (Extended)'!$Q$16","v":296.93180469866161},{"$f":"AB20/'Input (Extended)'!$R$16","v":556.74713380999049},{"$f":"AC20/'Input (Extended)'!$S$16","v":7174.5348619680053},{"$f":"AC20/'Input (Extended)'!$T$16","v":7174.5348619680053},null,{"$f":"(1+'Input (Extended)'!C32)*$AB$13","v":4453.9770704799239},{"$f":"(1+'Input (Extended)'!D32)*$AC$13","v":107618.02292952008},{"$f":"(1-'Input (Extended)'!E32)*$AD$13","v":3423},{"$f":"(1-'Input (Extended)'!F32)*$AE$13","v":91971},{"$f":"AD20+'Input (Extended)'!$C$20","v":4903},{"$f":"AE20+'Input (Extended)'!$D$20","v":99741},{"$f":"(1+'Input (Extended)'!G32)*$AH$13","v":9375},{"$f":"(1+'Input (Extended)'!H32)*(1-'Input (Extended)'!$F$20)*'Input (Extended)'!$I$16","v":4497.6717139117736},{"$f":"AF20/AI20","v":1.0901195800561663},{"$f":"(1+'Input (Extended)'!I32)*(1-'Input (Extended)'!$F$20)*'Input (Extended)'!$J$16","v":36942.795286088229},{"$f":"AG20/AK20","v":2.699876910439424},{"$f":"(1+'Input (Extended)'!J32)*(1-'Input (Extended)'!$G$20)*'Input (Extended)'!$K$16","v":850.66857200893753},{"$f":"AF20/AM20","v":5.7637018238737596},{"$f":"(1+'Input (Extended)'!K32)*(1-'Input (Extended)'!$G$20)*'Input (Extended)'!$L$16","v":596.79028316067433},{"$f":"AF20/AO20","v":8.2156163368363035},{"$f":"(1+'Input (Extended)'!L32)*(1-'Input (Extended)'!$G$20)*'Input (Extended)'!$M$16","v":11177.696884013811},{"$f":"AG20/AQ20","v":8.9232156708998094},{"$f":"(1+'Input (Extended)'!M32)*(1-'Input (Extended)'!$G$20)*'Input (Extended)'!$N$16","v":9073.504260816575},{"$f":"AG20/AS20","v":10.992555591859473},{"$f":"(AD20*'Input (Extended)'!$G$16)+('Input (Extended)'!$C$20*'Input (Extended)'!$E$20)","v":2404.29},{"$f":"AF20/'Input (Extended)'!$O$16","v":4903},{"$f":"AG20/'Input (Extended)'!$P$16","v":19948.2},{"$f":"AF20/'Input (Extended)'!$Q$16","v":326.86666666666667},{"$f":"AF20/'Input (Extended)'!$R$16","v":612.875},{"$f":"AG20/'Input (Extended)'!$S$16","v":6649.4},{"$f":"AG20/'Input (Extended)'!$T$16","v":6649.4}]
{"$rows_left_out":12}
{"sheet":"Output (Graphical)","index":4,"n_rows":284,"n_cols":18,"rows_kept":284,"cut":false,"hidden":false,"merged":[]}
[]
[]
[]
[]
[]
[]
[]
[]
[]
["OUTPUT BY CAPACITY VARIABLE"]
[]
[]
[]
[]
[]
[]
[]
[]
[]
[]
{"$rows_left_out":264}